Reaction Details
TargetHistone deacetylase 3
LigandBDBM25164
Substrate/Competitorn/a
Meas. Tech.ChEMBL_493210 (CHEMBL948440)
IC50>5000±n/a nM
Citation Scarpelli, RDi Marco, AFerrigno, FLaufer, RMarcucci, IMuraglia, EOntoria, JMRowley, MSerafini, SSteinkühler, CJones, P Studies of the metabolic stability in cells of 5-(trifluoroacetyl)thiophene-2-carboxamides and identification of more stable class II histone deacetylase (HDAC) inhibitors. Bioorg Med Chem Lett18:6078-82 (2008) 
 
Histone deacetylase 3
Name:Histone deacetylase 3
Type:Enzyme
Mol. Mass.:48829.55
Organism:Homo sapiens (Human)
Description:O15379
Residue:428
BDBM25164
NameBDBM25164
Synonyms:2,2,2-trifluoro-1-[5-({3-phenyl-5H,6H,7H,8H-imidazo[1,2-a]pyrazin-7-yl}carbonyl)thiophen-2-yl]ethan-1-one thiophene derivative, 3j
TypeSmall organic molecule
Emp. Form.C19H14F3N3O2S
Mol. Mass.405.394
SMILESFC(F)(F)C(=O)c1ccc(s1)C(=O)N1CCn2c(C1)ncc2-c1ccccc1