Reaction Details
TargetPotassium voltage-gated channel subfamily H member 2
LigandBDBM50246334
Substrate/Competitorn/a
Meas. Tech.ChEMBL_558278 (CHEMBL956578)
IC50 4300±n/a nM
Citation Mizutani, TNagase, TIto, SMiyamoto, YTanaka, TTakenaga, NTokita, SSato, N Development of novel 2-[4-(aminoalkoxy)phenyl]-4(3H)-quinazolinone derivatives as potent and selective histamine H3 receptor inverse agonists. Bioorg Med Chem Lett18:6041-5 (2008) 
 
Potassium voltage-gated channel subfamily H member 2
Name:Potassium voltage-gated channel subfamily H member 2
Type:Multi-pass membrane protein
Mol. Mass.:126672.65
Organism:Homo sapiens (Human)
Description:Q12809
Residue:1159
BDBM50246334
NameBDBM50246334
Synonyms:2-(4-(1-cyclobutylpiperidin-4-yloxy)phenyl)-7-methoxy-3-methylquinazolin-4(3H)-one | CHEMBL454879
TypeSmall organic molecule
Emp. Form.C25H29N3O3
Mol. Mass.419.5161
SMILESCOc1ccc2c(c1)nc(-c1ccc(OC3CCN(CC3)C3CCC3)cc1)n(C)c2=O