Reaction Details
TargetPotassium voltage-gated channel subfamily H member 2
LigandBDBM50246332
Substrate/Competitorn/a
Meas. Tech.ChEMBL_558278 (CHEMBL956578)
IC50>10000±n/a nM
Citation Mizutani, TNagase, TIto, SMiyamoto, YTanaka, TTakenaga, NTokita, SSato, N Development of novel 2-[4-(aminoalkoxy)phenyl]-4(3H)-quinazolinone derivatives as potent and selective histamine H3 receptor inverse agonists. Bioorg Med Chem Lett18:6041-5 (2008) 
 
Potassium voltage-gated channel subfamily H member 2
Name:Potassium voltage-gated channel subfamily H member 2
Type:Multi-pass membrane protein
Mol. Mass.:126672.65
Organism:Homo sapiens (Human)
Description:Q12809
Residue:1159
BDBM50246332
NameBDBM50246332
Synonyms:2-(4-(1-cyclobutylpiperidin-4-yloxy)phenyl)-5-methoxy-3-methylquinazolin-4(3H)-one | CHEMBL453653
TypeSmall organic molecule
Emp. Form.C25H29N3O3
Mol. Mass.419.5161
SMILESCOc1cccc2nc(-c3ccc(OC4CCN(CC4)C4CCC4)cc3)n(C)c(=O)c12