Reaction Details
TargetPotassium voltage-gated channel subfamily H member 2
LigandBDBM50246243
Substrate/Competitorn/a
Meas. Tech.ChEMBL_558278 (CHEMBL956578)
IC50 1800±n/a nM
Citation Mizutani, TNagase, TIto, SMiyamoto, YTanaka, TTakenaga, NTokita, SSato, N Development of novel 2-[4-(aminoalkoxy)phenyl]-4(3H)-quinazolinone derivatives as potent and selective histamine H3 receptor inverse agonists. Bioorg Med Chem Lett18:6041-5 (2008) 
 
Potassium voltage-gated channel subfamily H member 2
Name:Potassium voltage-gated channel subfamily H member 2
Type:Multi-pass membrane protein
Mol. Mass.:126672.65
Organism:Homo sapiens (Human)
Description:Q12809
Residue:1159
BDBM50246243
NameBDBM50246243
Synonyms:2-(4-(3-(piperidin-1-yl)propoxy)phenyl)-3-propylquinazolin-4(3H)-one | CHEMBL487230
TypeSmall organic molecule
Emp. Form.C25H31N3O2
Mol. Mass.405.5325
SMILESCCCn1c(nc2ccccc2c1=O)-c1ccc(OCCCN2CCCCC2)cc1