Reaction Details
TargetAlpha-1A adrenergic receptor
LigandBDBM50246290
Substrate/Competitorn/a
Meas. Tech.ChEMBL_558279 (CHEMBL956579)
IC50 6300±n/a nM
Citation Mizutani, TNagase, TIto, SMiyamoto, YTanaka, TTakenaga, NTokita, SSato, N Development of novel 2-[4-(aminoalkoxy)phenyl]-4(3H)-quinazolinone derivatives as potent and selective histamine H3 receptor inverse agonists. Bioorg Med Chem Lett18:6041-5 (2008) 
 
Alpha-1A adrenergic receptor
Name:Alpha-1A adrenergic receptor
Type:Cell-surface receptors
Mol. Mass.:51511.67
Organism:Homo sapiens (Human)
Description:P35348
Residue:466
BDBM50246290
NameBDBM50246290
Synonyms:2-(4-(1-cyclobutylpiperidin-4-yloxy)phenyl)-3-methylquinazolin-4(3H)-one | CHEMBL488249
TypeSmall organic molecule
Emp. Form.C24H27N3O2
Mol. Mass.389.4901
SMILESCn1c(nc2ccccc2c1=O)-c1ccc(OC2CCN(CC2)C2CCC2)cc1