Reaction Details
TargetAlpha-1A adrenergic receptor
LigandBDBM50246288
Substrate/Competitorn/a
Meas. Tech.ChEMBL_558279 (CHEMBL956579)
IC50 2400±n/a nM
Citation Mizutani, TNagase, TIto, SMiyamoto, YTanaka, TTakenaga, NTokita, SSato, N Development of novel 2-[4-(aminoalkoxy)phenyl]-4(3H)-quinazolinone derivatives as potent and selective histamine H3 receptor inverse agonists. Bioorg Med Chem Lett18:6041-5 (2008) 
 
Alpha-1A adrenergic receptor
Name:Alpha-1A adrenergic receptor
Type:Cell-surface receptors
Mol. Mass.:51511.67
Organism:Homo sapiens (Human)
Description:P35348
Residue:466
BDBM50246288
NameBDBM50246288
Synonyms:3-phenyl-2-(4-(3-(piperidin-1-yl)propoxy)phenyl)quinazolin-4(3H)-one | CHEMBL487060
TypeSmall organic molecule
Emp. Form.C28H29N3O2
Mol. Mass.439.5488
SMILESO=c1n(-c2ccccc2)c(nc2ccccc12)-c1ccc(OCCCN2CCCCC2)cc1