Reaction Details
TargetAlpha-1A adrenergic receptor
LigandBDBM50246287
Substrate/Competitorn/a
Meas. Tech.ChEMBL_558279 (CHEMBL956579)
IC50 7200±n/a nM
Citation Mizutani, TNagase, TIto, SMiyamoto, YTanaka, TTakenaga, NTokita, SSato, N Development of novel 2-[4-(aminoalkoxy)phenyl]-4(3H)-quinazolinone derivatives as potent and selective histamine H3 receptor inverse agonists. Bioorg Med Chem Lett18:6041-5 (2008) 
 
Alpha-1A adrenergic receptor
Name:Alpha-1A adrenergic receptor
Type:Cell-surface receptors
Mol. Mass.:51511.67
Organism:Homo sapiens (Human)
Description:P35348
Residue:466
BDBM50246287
NameBDBM50246287
Synonyms:3-benzyl-2-(4-(3-(piperidin-1-yl)propoxy)phenyl)quinazolin-4(3H)-one | CHEMBL487059
TypeSmall organic molecule
Emp. Form.C29H31N3O2
Mol. Mass.453.5753
SMILESO=c1n(Cc2ccccc2)c(nc2ccccc12)-c1ccc(OCCCN2CCCCC2)cc1