Reaction Details
TargetPlasmepsin II
LigandBDBM50273742
Substrate/Competitorn/a
Meas. Tech.ChEMBL_536036 (CHEMBL991606)
Ki 5±n/a nM
Citation Hidaka, KKimura, TRuben, AJUemura, TKamiya, MKiso, AOkamoto, TTsuchiya, YHayashi, YFreire, EKiso, Y Antimalarial activity enhancement in hydroxymethylcarbonyl (HMC) isostere-based dipeptidomimetics targeting malarial aspartic protease plasmepsin. Bioorg Med Chem16:10049-60 (2008) 
 
Plasmepsin II
Name:Plasmepsin II
Type:Enzyme
Mol. Mass.:51482.09
Organism:Plasmodium falciparum
Description:P46925
Residue:453
BDBM50273742
NameBDBM50273742
Synonyms:(R)-N-[(1S,2R)-2-Hydroxyindan-1-yl]-3-[(2S,3S)-3-(2,6-dimethyl-4-hydroxyphenoxyacetyl)amino-2-hydroxy-4-phenylbutanoyl]-5,5-dimethyl-1,3-thiazolidine-4-carboxamide KNI-10155
TypeSmall organic molecule
Emp. Form.C35H41N3O7S
Mol. Mass.647.781
SMILESCc1cc(O)cc(C)c1OCC(=O)N[C@@H](Cc1ccccc1)[C@H](O)C(=O)N1CSC(C)(C)[C@H]1C(=O)N[C@@H]1[C@H](O)Cc2ccccc12