Reaction Details
TargetPlasmepsin II
LigandBDBM50273747
Substrate/Competitorn/a
Meas. Tech.ChEMBL_536036 (CHEMBL991606)
Ki 30±n/a nM
Citation Hidaka, KKimura, TRuben, AJUemura, TKamiya, MKiso, AOkamoto, TTsuchiya, YHayashi, YFreire, EKiso, Y Antimalarial activity enhancement in hydroxymethylcarbonyl (HMC) isostere-based dipeptidomimetics targeting malarial aspartic protease plasmepsin. Bioorg Med Chem16:10049-60 (2008) 
 
Plasmepsin II
Name:Plasmepsin II
Type:Enzyme
Mol. Mass.:51482.09
Organism:Plasmodium falciparum
Description:P46925
Residue:453
BDBM50273747
NameBDBM50273747
Synonyms:(R)-N-[(1S,2R)-2-Hydroxyindan-1-yl]-3-[(2S,3S)-3-(2,6-dimethyl-4-butylamino-phenoxyacetyl)amino-2-hydroxy-4-phenylbutanoyl]-5,5-dimethyl-1,3-thiazolidine-4-carboxamide KNI-10539
TypeSmall organic molecule
Emp. Form.C39H50N4O6S
Mol. Mass.702.902
SMILESCCCCNc1cc(C)c(OCC(=O)N[C@@H](Cc2ccccc2)[C@H](O)C(=O)N2CSC(C)(C)[C@H]2C(=O)N[C@@H]2[C@H](O)Cc3ccccc23)c(C)c1