Reaction Details
TargetPeptidylglycine alpha-amidating monooxygenase
LigandBDBM50273494
Substrate/Competitorn/a
Meas. Tech.ChEMBL_536305 (CHEMBL990739)
IC50 35000±n/a nM
Citation Merkler, DJAsser, ASBaumgart, LECarballo, NCarpenter, SEChew, GHCosner, CCDusi, JGalloway, LCLowe, ABLowe, EWKing, LKendig, RDKline, PCMalka, RMerkler, KAMcIntyre, NRRomero, MWilcox, BJOwen, TC Substituted hippurates and hippurate analogs as substrates and inhibitors of peptidylglycine alpha-hydroxylating monooxygenase (PHM). Bioorg Med Chem16:10061-74 (2008) 
 
Peptidylglycine alpha-amidating monooxygenase
Name:Peptidylglycine alpha-amidating monooxygenase
Type:PROTEIN
Mol. Mass.:108665.78
Organism:Rattus norvegicus
Description:ChEMBL_536304
Residue:976
BDBM50273494
NameBDBM50273494
Synonyms:6-O-Palmitoyl-L-ascorbate | CHEMBL457018
TypeSmall organic molecule
Emp. Form.C22H40O7
Mol. Mass.416.5488
(=O)OC[C@H](O)[C@@H]1OC(=O)C(O)C1O