Reaction Details
TargetPotassium voltage-gated channel subfamily H member 2
LigandBDBM50275432
Substrate/Competitorn/a
Meas. Tech.ChEMBL_493399 (CHEMBL943380)
EC50>30000±n/a nM
Citation Payne, JEBonnefous, CHassig, CASymons, KTGuo, XNguyen, PMAnnable, TWash, PLHoffman, TZRao, TSShiau, AKMalecha, JWNoble, SAHager, JHSmith, ND Identification of KD5170: a novel mercaptoketone-based histone deacetylase inhibitor. Bioorg Med Chem Lett18:6093-6 (2008) 
 
Potassium voltage-gated channel subfamily H member 2
Name:Potassium voltage-gated channel subfamily H member 2
Type:Multi-pass membrane protein
Mol. Mass.:126672.65
Organism:Homo sapiens (Human)
Description:Q12809
Residue:1159
BDBM50275432
NameBDBM50275432
Synonyms:CHEMBL487965 | S-2-(6-(1,4-dihydrobenzo[d][1,2]dioxine-6-sulfonamido)pyridin-3-yl)-2-oxoethyl ethanethioate
TypeSmall organic molecule
Emp. Form.C17H16N2O6S2
Mol. Mass.408.449
SMILESCC(=O)SCC(=O)c1ccc(NS(=O)(=O)c2ccc3COOCc3c2)nc1