Reaction Details
TargetSodium-dependent serotonin transporter
LigandBDBM50274974
Substrate/Competitorn/a
Meas. Tech.ChEMBL_493415 (CHEMBL944372)
Ki 13±n/a nM
Citation Bannwart, LMCarter, DSCai, HYChoy, JCGreenhouse, RJaime-Figueroa, SIyer, PSLin, CJLee, EKLucas, MCLynch, SMMadera, AMMoore, AOzboya, KRaptova, LRoetz, RSchoenfeld, RCStein, KASteiner, SVilla, MWeikert, RJZhai, Y Novel 3,3-disubstituted pyrrolidines as selective triple serotonin/norepinephrine/dopamine reuptake inhibitors. Bioorg Med Chem Lett18:6062-6 (2008) 
 
Sodium-dependent serotonin transporter
Name:Sodium-dependent serotonin transporter
Type:Multi-pass membrane protein
Mol. Mass.:70322.51
Organism:Homo sapiens (Human)
Description:P31645
Residue:630
BDBM50274974
NameBDBM50274974
Synonyms:5-(3-benzylpyrrolidin-3-yl)-N-methyl-1H-indole-2-carboxamide | CHEMBL442924
TypeSmall organic molecule
Emp. Form.C21H23N3O
Mol. Mass.333.4268
SMILESCNC(=O)c1cc2cc(ccc2[nH]1)C1(Cc2ccccc2)CCNC1