Reaction Details
TargetSodium-dependent noradrenaline transporter
LigandBDBM50274920
Substrate/Competitorn/a
Meas. Tech.ChEMBL_493416 (CHEMBL944373)
Ki 8±n/a nM
Citation Bannwart, LMCarter, DSCai, HYChoy, JCGreenhouse, RJaime-Figueroa, SIyer, PSLin, CJLee, EKLucas, MCLynch, SMMadera, AMMoore, AOzboya, KRaptova, LRoetz, RSchoenfeld, RCStein, KASteiner, SVilla, MWeikert, RJZhai, Y Novel 3,3-disubstituted pyrrolidines as selective triple serotonin/norepinephrine/dopamine reuptake inhibitors. Bioorg Med Chem Lett18:6062-6 (2008) 
 
Sodium-dependent noradrenaline transporter
Name:Sodium-dependent noradrenaline transporter
Type:Multi-pass membrane protein
Mol. Mass.:69337.72
Organism:Homo sapiens (Human)
Description:P23975
Residue:617
BDBM50274920
NameBDBM50274920
Synonyms:5-(3-(pyridin-2-ylmethyl)pyrrolidin-3-yl)-1H-indole | CHEMBL456654
TypeSmall organic molecule
Emp. Form.C18H19N3
Mol. Mass.277.3636
SMILESC(c1ccccn1)C1(CCNC1)c1ccc2[nH]ccc2c1