Reaction Details
TargetSodium-dependent serotonin transporter
LigandBDBM50274918
Substrate/Competitorn/a
Meas. Tech.ChEMBL_493415 (CHEMBL944372)
Ki 190±n/a nM
Citation Bannwart, LMCarter, DSCai, HYChoy, JCGreenhouse, RJaime-Figueroa, SIyer, PSLin, CJLee, EKLucas, MCLynch, SMMadera, AMMoore, AOzboya, KRaptova, LRoetz, RSchoenfeld, RCStein, KASteiner, SVilla, MWeikert, RJZhai, Y Novel 3,3-disubstituted pyrrolidines as selective triple serotonin/norepinephrine/dopamine reuptake inhibitors. Bioorg Med Chem Lett18:6062-6 (2008) 
 
Sodium-dependent serotonin transporter
Name:Sodium-dependent serotonin transporter
Type:Multi-pass membrane protein
Mol. Mass.:70322.51
Organism:Homo sapiens (Human)
Description:P31645
Residue:630
BDBM50274918
NameBDBM50274918
Synonyms:(+)-6-(3-benzylpyrrolidin-3-yl)-1H-indole 6-(3-benzylpyrrolidin-3-yl)-1H-indole | CHEMBL459165
TypeSmall organic molecule
Emp. Form.C19H20N2
Mol. Mass.276.3755
SMILESC(c1ccccc1)C1(CCNC1)c1ccc2cc[nH]c2c1