Reaction Details
TargetSodium-dependent serotonin transporter
LigandBDBM50275440
Substrate/Competitorn/a
Meas. Tech.ChEMBL_493415 (CHEMBL944372)
Ki 7±n/a nM
Citation Bannwart, LMCarter, DSCai, HYChoy, JCGreenhouse, RJaime-Figueroa, SIyer, PSLin, CJLee, EKLucas, MCLynch, SMMadera, AMMoore, AOzboya, KRaptova, LRoetz, RSchoenfeld, RCStein, KASteiner, SVilla, MWeikert, RJZhai, Y Novel 3,3-disubstituted pyrrolidines as selective triple serotonin/norepinephrine/dopamine reuptake inhibitors. Bioorg Med Chem Lett18:6062-6 (2008) 
 
Sodium-dependent serotonin transporter
Name:Sodium-dependent serotonin transporter
Type:Multi-pass membrane protein
Mol. Mass.:70322.51
Organism:Homo sapiens (Human)
Description:P31645
Residue:630
BDBM50275440
NameBDBM50275440
Synonyms:3-(benzo[b]thiophen-5-yl)-3-benzylpyrrolidine | CHEMBL486537
TypeSmall organic molecule
Emp. Form.C19H19NS
Mol. Mass.293.426
SMILESC(c1ccccc1)C1(CCNC1)c1ccc2sccc2c1