Reaction Details
TargetSodium-dependent noradrenaline transporter
LigandBDBM50274975
Substrate/Competitorn/a
Meas. Tech.ChEMBL_493416 (CHEMBL944373)
Ki 10±n/a nM
Citation Bannwart, LMCarter, DSCai, HYChoy, JCGreenhouse, RJaime-Figueroa, SIyer, PSLin, CJLee, EKLucas, MCLynch, SMMadera, AMMoore, AOzboya, KRaptova, LRoetz, RSchoenfeld, RCStein, KASteiner, SVilla, MWeikert, RJZhai, Y Novel 3,3-disubstituted pyrrolidines as selective triple serotonin/norepinephrine/dopamine reuptake inhibitors. Bioorg Med Chem Lett18:6062-6 (2008) 
 
Sodium-dependent noradrenaline transporter
Name:Sodium-dependent noradrenaline transporter
Type:Multi-pass membrane protein
Mol. Mass.:69337.72
Organism:Homo sapiens (Human)
Description:P23975
Residue:617
BDBM50274975
NameBDBM50274975
Synonyms:5-(3-benzylpyrrolidin-3-yl)-N,N-dimethyl-1H-indole-2-carboxamide | CHEMBL463387
TypeSmall organic molecule
Emp. Form.C22H25N3O
Mol. Mass.347.4534
SMILESCN(C)C(=O)c1cc2cc(ccc2[nH]1)C1(Cc2ccccc2)CCNC1