Reaction Details
TargetThyroid hormone receptor alpha
LigandBDBM50275228
Substrate/Competitorn/a
Meas. Tech.ChEMBL_493724 (CHEMBL949479)
Ki 61.6±n/a nM
Citation Boyer, SHJiang, HJacintho, JDReddy, MVLi, HLi, WGodwin, JLSchulz, WGCable, EEHou, JWu, RFujitaki, JMHecker, SJErion, MD Synthesis and biological evaluation of a series of liver-selective phosphonic acid thyroid hormone receptor agonists and their prodrugs. J Med Chem51:7075-93 (2009) 
 
Thyroid hormone receptor alpha
Name:Thyroid hormone receptor alpha
Type:Receptor
Mol. Mass.:54818.00
Organism:Homo sapiens (Human)
Description:Recombinant hThR was obtained from nuclear extracts from SF9 cells infected with baculovirus vectors encoding for ThRalpha 1.
Residue:490
BDBM50275228
NameBDBM50275228
Synonyms:CHEMBL485928 | [3,5-Dimethyl-4-(3'-ethyl-4'-hydroxybenzyl)phenoxy]methylphosphonicAcid
TypeSmall organic molecule
Emp. Form.C18H23O5P
Mol. Mass.350.346
SMILESCCc1cc(Cc2c(C)cc(OCP(O)(O)=O)cc2C)ccc1O