Reaction Details
TargetThyroid hormone receptor alpha
LigandBDBM50274846
Substrate/Competitorn/a
Meas. Tech.ChEMBL_493724 (CHEMBL949479)
Ki 10.3±n/a nM
Citation Boyer, SHJiang, HJacintho, JDReddy, MVLi, HLi, WGodwin, JLSchulz, WGCable, EEHou, JWu, RFujitaki, JMHecker, SJErion, MD Synthesis and biological evaluation of a series of liver-selective phosphonic acid thyroid hormone receptor agonists and their prodrugs. J Med Chem51:7075-93 (2009) 
 
Thyroid hormone receptor alpha
Name:Thyroid hormone receptor alpha
Type:Receptor
Mol. Mass.:54818.00
Organism:Homo sapiens (Human)
Description:Recombinant hThR was obtained from nuclear extracts from SF9 cells infected with baculovirus vectors encoding for ThRalpha 1.
Residue:490
BDBM50274846
NameBDBM50274846
Synonyms:CHEMBL511862 | [3,5-Dibromo-4-(4'-hydroxy-3'-isopropylphenoxy)phenylamino]methylphosphonic Acid
TypeSmall organic molecule
Emp. Form.C16H18Br2NO5P
Mol. Mass.495.1
SMILESCC(C)c1cc(Oc2c(Br)cc(NCP(O)(O)=O)cc2Br)ccc1O