Reaction Details
TargetThyroid hormone receptor beta
LigandBDBM50275226
Substrate/Competitorn/a
Meas. Tech.ChEMBL_493725 (CHEMBL949480)
Ki 36±n/a nM
Citation Boyer, SHJiang, HJacintho, JDReddy, MVLi, HLi, WGodwin, JLSchulz, WGCable, EEHou, JWu, RFujitaki, JMHecker, SJErion, MD Synthesis and biological evaluation of a series of liver-selective phosphonic acid thyroid hormone receptor agonists and their prodrugs. J Med Chem51:7075-93 (2009) 
 
Thyroid hormone receptor beta
Name:Thyroid hormone receptor beta
Type:Receptor
Mol. Mass.:52793.62
Organism:Homo sapiens (Human)
Description:Recombinant hThR was obtained from nuclear extracts from SF9 cells infected with baculovirus vectors encoding for ThRbeta 1.
Residue:461
BDBM50275226
NameBDBM50275226
Synonyms:CHEMBL505084 | N-[3,5-Dimethyl-4-(3'-isopropyl-4'-methoxyphenoxy)]carbamonylphosphonicAcid
TypeSmall organic molecule
Emp. Form.C18H22NO6P
Mol. Mass.379.3441
SMILESCC(C)c1cc(Oc2c(C)cc(NC(=O)P(O)(O)=O)cc2C)ccc1O