Reaction Details
TargetThyroid hormone receptor beta
LigandBDBM50275227
Substrate/Competitorn/a
Meas. Tech.ChEMBL_493725 (CHEMBL949480)
Ki 89.7±n/a nM
Citation Boyer, SHJiang, HJacintho, JDReddy, MVLi, HLi, WGodwin, JLSchulz, WGCable, EEHou, JWu, RFujitaki, JMHecker, SJErion, MD Synthesis and biological evaluation of a series of liver-selective phosphonic acid thyroid hormone receptor agonists and their prodrugs. J Med Chem51:7075-93 (2009) 
 
Thyroid hormone receptor beta
Name:Thyroid hormone receptor beta
Type:Receptor
Mol. Mass.:52793.62
Organism:Homo sapiens (Human)
Description:Recombinant hThR was obtained from nuclear extracts from SF9 cells infected with baculovirus vectors encoding for ThRbeta 1.
Residue:461
BDBM50275227
NameBDBM50275227
Synonyms:CHEMBL485927 | [3,5-Dimethyl-4-(4'-hydroxy-3'-methylbenzyl)phenoxy]methylphosphonicAcid
TypeSmall organic molecule
Emp. Form.C17H21O5P
Mol. Mass.336.3194
SMILESCc1cc(Cc2c(C)cc(OCP(O)(O)=O)cc2C)ccc1O