Reaction Details
TargetThyroid hormone receptor beta
LigandBDBM50275290
Substrate/Competitorn/a
Meas. Tech.ChEMBL_493725 (CHEMBL949480)
Ki 31.3±n/a nM
Citation Boyer, SHJiang, HJacintho, JDReddy, MVLi, HLi, WGodwin, JLSchulz, WGCable, EEHou, JWu, RFujitaki, JMHecker, SJErion, MD Synthesis and biological evaluation of a series of liver-selective phosphonic acid thyroid hormone receptor agonists and their prodrugs. J Med Chem51:7075-93 (2009) 
 
Thyroid hormone receptor beta
Name:Thyroid hormone receptor beta
Type:Receptor
Mol. Mass.:52793.62
Organism:Homo sapiens (Human)
Description:Recombinant hThR was obtained from nuclear extracts from SF9 cells infected with baculovirus vectors encoding for ThRbeta 1.
Residue:461
BDBM50275290
NameBDBM50275290
Synonyms:2-[3,5-Dimethoxy-4-(4'-hydroxy-3'-isopropylbenzyl)phenyl]ethylphosphonicAcid | CHEMBL519215
TypeSmall organic molecule
Emp. Form.C20H27O4P
Mol. Mass.362.3997
SMILESCC(C)c1cc(Cc2c(C)cc(CCP(O)(O)=O)cc2C)ccc1O