Reaction Details
TargetThyroid hormone receptor beta
LigandBDBM50274809
Substrate/Competitorn/a
Meas. Tech.ChEMBL_493725 (CHEMBL949480)
Ki 0.84±n/a nM
Citation Boyer, SHJiang, HJacintho, JDReddy, MVLi, HLi, WGodwin, JLSchulz, WGCable, EEHou, JWu, RFujitaki, JMHecker, SJErion, MD Synthesis and biological evaluation of a series of liver-selective phosphonic acid thyroid hormone receptor agonists and their prodrugs. J Med Chem51:7075-93 (2009) 
 
Thyroid hormone receptor beta
Name:Thyroid hormone receptor beta
Type:Receptor
Mol. Mass.:52793.62
Organism:Homo sapiens (Human)
Description:Recombinant hThR was obtained from nuclear extracts from SF9 cells infected with baculovirus vectors encoding for ThRbeta 1.
Residue:461
BDBM50274809
NameBDBM50274809
Synonyms:3,5-Diiodo-4-(4'-hydroxy-3'-isopropylphenoxy)benzylphosphonicAcid | CHEMBL512383
TypeSmall organic molecule
Emp. Form.C16H17I2O5P
Mol. Mass.574.0859
SMILESCC(C)c1cc(Oc2c(I)cc(CP(O)(O)=O)cc2I)ccc1O