Reaction Details
TargetWee1-like protein kinase
LigandBDBM50279728
Substrate/Competitorn/a
Meas. Tech.ChEMBL_522127 (CHEMBL1006579)
IC50 46±n/a nM
Citation Wichapong, KLindner, MPianwanit, SKokpol, SSippl, W Receptor-based 3D-QSAR studies of checkpoint Wee1 kinase inhibitors. Eur J Med Chem44:1383-95 (2009) 
 
Wee1-like protein kinase
Name:Wee1-like protein kinase
Type:PROTEIN
Mol. Mass.:71599.12
Organism:Homo sapiens (Human)
Description:ChEMBL_1445054
Residue:646
BDBM50279728
NameBDBM50279728
Synonyms:CHEMBL514192 | N-(2-(1H-pyrrol-1-yl)ethyl)-4-(2-chlorophenyl)-9-hydroxy-6-methyl-1,3-dioxo-1,2,3,6-tetrahydropyrrolo[3,4-c]carbazole-8-sulfonamide
TypeSmall organic molecule
Emp. Form.C27H21ClN4O5S
Mol. Mass.548.997
SMILESCn1c2cc(c(O)cc2c2c3C(=O)NC(=O)c3c(cc12)-c1ccccc1Cl)S(=O)(=O)NCCn1cccc1