Reaction Details
TargetWee1-like protein kinase
LigandBDBM50279633
Substrate/Competitorn/a
Meas. Tech.ChEMBL_522127 (CHEMBL1006579)
IC50 9±n/a nM
Citation Wichapong, KLindner, MPianwanit, SKokpol, SSippl, W Receptor-based 3D-QSAR studies of checkpoint Wee1 kinase inhibitors. Eur J Med Chem44:1383-95 (2009) 
 
Wee1-like protein kinase
Name:Wee1-like protein kinase
Type:PROTEIN
Mol. Mass.:71599.12
Organism:Homo sapiens (Human)
Description:ChEMBL_1445054
Residue:646
BDBM50279633
NameBDBM50279633
Synonyms:6-(2-(1H-1,2,3-triazol-1-ylsulfinyl)ethyl)-4-(2-chlorophenyl)-9-hydroxypyrrolo[3,4-c]carbazole-1,3(2H,6H)-dione | CHEMBL486517
TypeSmall organic molecule
Emp. Form.C24H16ClN5O4S
Mol. Mass.505.933
SMILESOc1ccc2n(CCS(=O)n3ccnn3)c3cc(c4C(=O)NC(=O)c4c3c2c1)-c1ccccc1Cl