Reaction Details
TargetWee1-like protein kinase
LigandBDBM50192385
Substrate/Competitorn/a
Meas. Tech.ChEMBL_522127 (CHEMBL1006579)
IC50 68±n/a nM
Citation Wichapong, KLindner, MPianwanit, SKokpol, SSippl, W Receptor-based 3D-QSAR studies of checkpoint Wee1 kinase inhibitors. Eur J Med Chem44:1383-95 (2009) 
 
Wee1-like protein kinase
Name:Wee1-like protein kinase
Type:PROTEIN
Mol. Mass.:71599.12
Organism:Homo sapiens (Human)
Description:ChEMBL_1445054
Residue:646
BDBM50192385
NameBDBM50192385
Synonyms:9-hydroxy-4-(4-hydroxyphenyl)pyrrolo[3,4-c]carbazole-1,3(2H,6H)-dione | CHEMBL212660
TypeSmall organic molecule
Emp. Form.C20H12N2O4
Mol. Mass.344.3203
SMILESOc1ccc(cc1)-c1cc2[nH]c3ccc(O)cc3c2c2C(=O)NC(=O)c12