Reaction Details
TargetWee1-like protein kinase
LigandBDBM50192383
Substrate/Competitorn/a
Meas. Tech.ChEMBL_522127 (CHEMBL1006579)
IC50 190±n/a nM
Citation Wichapong, KLindner, MPianwanit, SKokpol, SSippl, W Receptor-based 3D-QSAR studies of checkpoint Wee1 kinase inhibitors. Eur J Med Chem44:1383-95 (2009) 
 
Wee1-like protein kinase
Name:Wee1-like protein kinase
Type:PROTEIN
Mol. Mass.:71599.12
Organism:Homo sapiens (Human)
Description:ChEMBL_1445054
Residue:646
BDBM50192383
NameBDBM50192383
Synonyms:2-(9-hydroxy-1,3-dioxo-1,2,3,6-tetrahydropyrrolo[3,4-c]carbazol-4-yl)benzonitrile | CHEMBL209448
TypeSmall organic molecule
Emp. Form.C21H11N3O3
Mol. Mass.353.3303
SMILESOc1ccc2[nH]c3cc(c4C(=O)NC(=O)c4c3c2c1)-c1ccccc1C#N