Reaction Details
TargetWee1-like protein kinase
LigandBDBM50192348
Substrate/Competitorn/a
Meas. Tech.ChEMBL_522127 (CHEMBL1006579)
IC50 37000±n/a nM
Citation Wichapong, KLindner, MPianwanit, SKokpol, SSippl, W Receptor-based 3D-QSAR studies of checkpoint Wee1 kinase inhibitors. Eur J Med Chem44:1383-95 (2009) 
 
Wee1-like protein kinase
Name:Wee1-like protein kinase
Type:PROTEIN
Mol. Mass.:71599.12
Organism:Homo sapiens (Human)
Description:ChEMBL_1445054
Residue:646
BDBM50192348
NameBDBM50192348
Synonyms:9-hydroxy-4-phenyl-1,2-dihydropyrrolo[3,4-c]carbazol-3(6H)-one CHEMBL386979
TypeSmall organic molecule
Emp. Form.C20H14N2O2
Mol. Mass.314.3374
SMILESOc1ccc2[nH]c3cc(c4C(=O)NCc4c3c2c1)-c1ccccc1