Reaction Details
TargetWee1-like protein kinase
LigandBDBM50192350
Substrate/Competitorn/a
Meas. Tech.ChEMBL_522127 (CHEMBL1006579)
IC50 2344±n/a nM
Citation Wichapong, KLindner, MPianwanit, SKokpol, SSippl, W Receptor-based 3D-QSAR studies of checkpoint Wee1 kinase inhibitors. Eur J Med Chem44:1383-95 (2009) 
 
Wee1-like protein kinase
Name:Wee1-like protein kinase
Type:PROTEIN
Mol. Mass.:71599.12
Organism:Homo sapiens (Human)
Description:ChEMBL_1445054
Residue:646
BDBM50192350
NameBDBM50192350
Synonyms:9-hydroxy-4,5-diphenylpyrrolo[3,4-c]carbazole-1,3(2H,6H)-dione | CHEMBL385047
TypeSmall organic molecule
Emp. Form.C26H16N2O3
Mol. Mass.404.4168
SMILESOc1ccc2[nH]c3c(-c4ccccc4)c(c4C(=O)NC(=O)c4c3c2c1)-c1ccccc1