Reaction Details
TargetWee1-like protein kinase
LigandBDBM50192361
Substrate/Competitorn/a
Meas. Tech.ChEMBL_522127 (CHEMBL1006579)
IC50 78±n/a nM
Citation Wichapong, KLindner, MPianwanit, SKokpol, SSippl, W Receptor-based 3D-QSAR studies of checkpoint Wee1 kinase inhibitors. Eur J Med Chem44:1383-95 (2009) 
 
Wee1-like protein kinase
Name:Wee1-like protein kinase
Type:PROTEIN
Mol. Mass.:71599.12
Organism:Homo sapiens (Human)
Description:ChEMBL_1445054
Residue:646
BDBM50192361
NameBDBM50192361
Synonyms:9-Hydroxy-4-phenyl-6-thia-2-aza-cyclopenta[c]fluorene-1,3-dione CHEMBL378756
TypeSmall organic molecule
Emp. Form.C20H11NO3S
Mol. Mass.345.371
SMILESOc1ccc2sc3cc(c4C(=O)NC(=O)c4c3c2c1)-c1ccccc1