Reaction Details
TargetWee1-like protein kinase
LigandBDBM50279535
Substrate/Competitorn/a
Meas. Tech.ChEMBL_522127 (CHEMBL1006579)
IC50 64±n/a nM
Citation Wichapong, KLindner, MPianwanit, SKokpol, SSippl, W Receptor-based 3D-QSAR studies of checkpoint Wee1 kinase inhibitors. Eur J Med Chem44:1383-95 (2009) 
 
Wee1-like protein kinase
Name:Wee1-like protein kinase
Type:PROTEIN
Mol. Mass.:71599.12
Organism:Homo sapiens (Human)
Description:ChEMBL_1445054
Residue:646
BDBM50279535
NameBDBM50279535
Synonyms:4-(2,6-dichlorophenyl)-9-hydroxy-6-(4-morpholino-4-oxobutyl)pyrrolo[3,4-c]carbazole-1,3(2H,6H)-dione | CHEMBL483611
TypeSmall organic molecule
Emp. Form.C28H23Cl2N3O5
Mol. Mass.552.405
SMILESOc1ccc2n(CCCC(=O)N3CCOCC3)c3cc(c4C(=O)NC(=O)c4c3c2c1)-c1c(Cl)cccc1Cl