Reaction Details
TargetWee1-like protein kinase
LigandBDBM50279747
Substrate/Competitorn/a
Meas. Tech.ChEMBL_522127 (CHEMBL1006579)
IC50 200±n/a nM
Citation Wichapong, KLindner, MPianwanit, SKokpol, SSippl, W Receptor-based 3D-QSAR studies of checkpoint Wee1 kinase inhibitors. Eur J Med Chem44:1383-95 (2009) 
 
Wee1-like protein kinase
Name:Wee1-like protein kinase
Type:PROTEIN
Mol. Mass.:71599.12
Organism:Homo sapiens (Human)
Description:ChEMBL_1445054
Residue:646
BDBM50279747
NameBDBM50279747
Synonyms:9-hydroxy-6-(3-hydroxypropyl)pyrrolo[3,4-c]carbazole-1,3(2H,6H)-dione | CHEMBL509601
TypeSmall organic molecule
Emp. Form.C17H14N2O4
Mol. Mass.310.3041
SMILESOCCCn1c2ccc(O)cc2c2c3C(=O)NC(=O)c3ccc12