Reaction Details
TargetWee1-like protein kinase
LigandBDBM50192436
Substrate/Competitorn/a
Meas. Tech.ChEMBL_522127 (CHEMBL1006579)
IC50 182±n/a nM
Citation Wichapong, KLindner, MPianwanit, SKokpol, SSippl, W Receptor-based 3D-QSAR studies of checkpoint Wee1 kinase inhibitors. Eur J Med Chem44:1383-95 (2009) 
 
Wee1-like protein kinase
Name:Wee1-like protein kinase
Type:PROTEIN
Mol. Mass.:71599.12
Organism:Homo sapiens (Human)
Description:ChEMBL_1445054
Residue:646
BDBM50192436
NameBDBM50192436
Synonyms:9-hydroxy-4-(1H-pyrrol-2-yl)pyrrolo[3,4-c]carbazole-1,3(2H,6H)-dione | CHEMBL379149
TypeSmall organic molecule
Emp. Form.C18H11N3O3
Mol. Mass.317.2982
SMILESOc1ccc2[nH]c3cc(-c4ccc[nH]4)c4C(=O)NC(=O)c4c3c2c1