Reaction Details
TargetEnvelope glycoprotein gp70
LigandBDBM50273883
Substrate/Competitorn/a
Meas. Tech.ChEMBL_536775 (CHEMBL984569)
IC50 2600±n/a nM
Citation LaFrate, ALGunther, JRCarlson, KEKatzenellenbogen, JA Synthesis and biological evaluation of guanylhydrazone coactivator binding inhibitors for the estrogen receptor. Bioorg Med Chem16:10075-84 (2008) 
 
Envelope glycoprotein gp70
Name:Envelope glycoprotein gp70
Type:PROTEIN
Mol. Mass.:77236.72
Organism:Mouse mammary tumor virus (strain GR) (MMTV)
Description:ChEMBL_536775
Residue:688
BDBM50273883
NameBDBM50273883
Synonyms:CHEMBL460174 | beta-Chloro-alpha-methylcinnamaldehyde guanylhydrazone
TypeSmall organic molecule
Emp. Form.C11H13ClN4
Mol. Mass.236.701
SMILES[#6]-[#6](-[#6]=[#7]\[#7]=[#6](\[#7])-[#7])=[#6](Cl)-c1ccccc1