Reaction Details
TargetEnvelope glycoprotein gp70
LigandBDBM50273852
Substrate/Competitorn/a
Meas. Tech.ChEMBL_536775 (CHEMBL984569)
IC50 4000±n/a nM
Citation LaFrate, ALGunther, JRCarlson, KEKatzenellenbogen, JA Synthesis and biological evaluation of guanylhydrazone coactivator binding inhibitors for the estrogen receptor. Bioorg Med Chem16:10075-84 (2008) 
 
Envelope glycoprotein gp70
Name:Envelope glycoprotein gp70
Type:PROTEIN
Mol. Mass.:77236.72
Organism:Mouse mammary tumor virus (strain GR) (MMTV)
Description:ChEMBL_536775
Residue:688
BDBM50273852
NameBDBM50273852
Synonyms:9-Chloro-6,7-dihydro-5-benzocycloheptene-8-carboxaldehyde guanylhydrazone | CHEMBL456594
TypeSmall organic molecule
Emp. Form.C13H15ClN4
Mol. Mass.262.738
SMILES[#7]\[#6](-[#7])=[#7]\[#7]=[#6]-[#6]-1=[#6](Cl)-c2ccccc2-[#6]-[#6]-[#6]-1