Reaction Details
TargetEnvelope glycoprotein gp70
LigandBDBM50273850
Substrate/Competitorn/a
Meas. Tech.ChEMBL_536775 (CHEMBL984569)
IC50 9400±n/a nM
Citation LaFrate, ALGunther, JRCarlson, KEKatzenellenbogen, JA Synthesis and biological evaluation of guanylhydrazone coactivator binding inhibitors for the estrogen receptor. Bioorg Med Chem16:10075-84 (2008) 
 
Envelope glycoprotein gp70
Name:Envelope glycoprotein gp70
Type:PROTEIN
Mol. Mass.:77236.72
Organism:Mouse mammary tumor virus (strain GR) (MMTV)
Description:ChEMBL_536775
Residue:688
BDBM50273850
NameBDBM50273850
Synonyms:1-Chloro-3-dihydro-4-methylnaphthalene-2-carboxaldehyde guanylhydrazone | CHEMBL456393
TypeSmall organic molecule
Emp. Form.C13H15ClN4
Mol. Mass.262.738
SMILES[#6]-[#6]-1-[#6]-[#6](-[#6]=[#7]\[#7]=[#6](\[#7])-[#7])=[#6](Cl)-c2ccccc-12