Reaction Details
TargetEnvelope glycoprotein gp70
LigandBDBM50273848
Substrate/Competitorn/a
Meas. Tech.ChEMBL_536775 (CHEMBL984569)
IC50 2100±n/a nM
Citation LaFrate, ALGunther, JRCarlson, KEKatzenellenbogen, JA Synthesis and biological evaluation of guanylhydrazone coactivator binding inhibitors for the estrogen receptor. Bioorg Med Chem16:10075-84 (2008) 
 
Envelope glycoprotein gp70
Name:Envelope glycoprotein gp70
Type:PROTEIN
Mol. Mass.:77236.72
Organism:Mouse mammary tumor virus (strain GR) (MMTV)
Description:ChEMBL_536775
Residue:688
BDBM50273848
NameBDBM50273848
Synonyms:1-Chloro-6-methoxy-3,4-dihydronaphthalene-2-carboxaldehyde guanylhydrazone | CHEMBL456106
TypeSmall organic molecule
Emp. Form.C13H15ClN4O
Mol. Mass.278.737
SMILES[#6]-[#8]-c1ccc2-[#6](Cl)=[#6](-[#6]-[#6]-c2c1)-[#6]=[#7]\[#7]=[#6](\[#7])-[#7]