Reaction Details
TargetCannabinoid receptor 2
LigandBDBM50256319
Substrate/Competitorn/a
Meas. Tech.ChEMBL_519287 (CHEMBL947739)
Ki 1±n/a nM
Citation Kai, HMorioka, YKoriyama, YOkamoto, KHasegawa, YHattori, MKoike, KChiba, HShinohara, SIwamoto, YTakahashi, KTanimoto, N 2-Arylimino-5,6-dihydro-4H-1,3-thiazines as a new class of cannabinoid receptor agonists. Part 3: Synthesis and activity of isosteric analogs. Bioorg Med Chem Lett18:6444-7 (2008) 
 
Cannabinoid receptor 2
Name:Cannabinoid receptor 2
Type:G Protein-Coupled Receptor (GPCR)
Mol. Mass.:39690.94
Organism:Homo sapiens (Human)
Description:P34972
Residue:360
BDBM50256319
NameBDBM50256319
Synonyms:CHEMBL519288 | methyl 3-(3-(3-ethylpentan-3-yl)isoxazol-5-ylimino)-2-oxa-4-azaspiro[5.5]undecane-4-carbodithioate
TypeSmall organic molecule
Emp. Form.C21H33N3O2S2
Mol. Mass.423.636
SMILESCCC(CC)(CC)c1cc(\N=C2/OCC3(CCCCC3)CN2C(=S)SC)on1