Reaction Details
TargetPotassium voltage-gated channel subfamily H member 2
LigandBDBM50246396
Substrate/Competitorn/a
Meas. Tech.ChEMBL_558914 (CHEMBL1022593)
IC50 16000±n/a nM
Citation Jones, CDAndrews, DMBarker, AJBlades, KByth, KFFinlay, MRGeh, CGreen, CPJohannsen, MWalker, MWeir, HM Imidazole pyrimidine amides as potent, orally bioavailable cyclin-dependent kinase inhibitors. Bioorg Med Chem Lett18:6486-9 (2008) 
 
Potassium voltage-gated channel subfamily H member 2
Name:Potassium voltage-gated channel subfamily H member 2
Type:Multi-pass membrane protein
Mol. Mass.:126672.65
Organism:Homo sapiens (Human)
Description:Q12809
Residue:1159
BDBM50246396
NameBDBM50246396
Synonyms:2-fluoro-4-(4-(1-isopropyl-2-methyl-1H-imidazol-5-yl)pyrimidin-2-ylamino)-N-methylbenzamide | CHEMBL455428
TypeSmall organic molecule
Emp. Form.C19H21FN6O
Mol. Mass.368.408
SMILESCNC(=O)c1ccc(Nc2nccc(n2)-c2cnc(C)n2C(C)C)cc1F