Reaction Details
TargetCyclin-dependent kinase-like 1 [2-358]
LigandBDBM50246396
Substrate/Competitorn/a
Meas. Tech.ChEMBL_558916 (CHEMBL1022595)
IC50 60±n/a nM
Citation Jones, CDAndrews, DMBarker, AJBlades, KByth, KFFinlay, MRGeh, CGreen, CPJohannsen, MWalker, MWeir, HM Imidazole pyrimidine amides as potent, orally bioavailable cyclin-dependent kinase inhibitors. Bioorg Med Chem Lett18:6486-9 (2008) 
 
Cyclin-dependent kinase-like 1 [2-358]
Name:Cyclin-dependent kinase-like 1 [2-358]
Type:PROTEIN
Mol. Mass.:41689.97
Organism:Homo sapiens (Human)
Description:ChEMBL_774421
Residue:357
BDBM50246396
NameBDBM50246396
Synonyms:2-fluoro-4-(4-(1-isopropyl-2-methyl-1H-imidazol-5-yl)pyrimidin-2-ylamino)-N-methylbenzamide | CHEMBL455428
TypeSmall organic molecule
Emp. Form.C19H21FN6O
Mol. Mass.368.408
SMILESCNC(=O)c1ccc(Nc2nccc(n2)-c2cnc(C)n2C(C)C)cc1F