Reaction Details
TargetConcanavalin-A
LigandBDBM50246207
Substrate/Competitorn/a
Meas. Tech.ChEMBL_559137 (CHEMBL1012082)
IC50 19000±n/a nM
Citation Welch, KTTurner, TAPreast, CE Rational design of novel glycomimetics: inhibitors of concanavalin A. Bioorg Med Chem Lett18:6573-5 (2008) 
 
Concanavalin-A
Name:Concanavalin-A
Synonyms:CONA_CANEN
Type:PROTEIN
Mol. Mass.:31477.03
Organism:Canavalia ensiformis
Description:ChEMBL_559137
Residue:290
BDBM50246207
NameBDBM50246207
TypeSmall organic molecule
Emp. Form.C8H8N2O6S
Mol. Mass.260.224
SMILESNNS(=O)(=O)c1cc(cc(c1)C(O)=O)C(O)=O