Reaction Details
TargetNociceptin receptor
LigandBDBM50245836
Substrate/Competitorn/a
Meas. Tech.ChEMBL_559149 (CHEMBL1012094)
Ki 5±n/a nM
Citation Yang, SWHo, GTulshian, DGreenlee, WJFernandez, XMcLeod, RLEckel, SAnthes, J Structure-activity relationships of 3-substituted N-benzhydryl-nortropane analogs as nociceptin receptor ligands for the treatment of cough. Bioorg Med Chem Lett18:6340-3 (2008) 
 
Nociceptin receptor
Name:Nociceptin receptor
Type:G Protein-Coupled Receptor (GPCR)
Mol. Mass.:40702.87
Organism:Homo sapiens (Human)
Description:P41146
Residue:370
BDBM50245836
NameBDBM50245836
Synonyms:(rel)-N-((8-(bis(2-chlorophenyl)methyl)-3-(pyridin-2-yl)-8-aza-bicyclo[3.2.1]octan-3-yl)methyl)acetamide | CHEMBL508750
TypeSmall organic molecule
Emp. Form.C28H29Cl2N3O
Mol. Mass.494.455
SMILESCC(=O)NCC1(C[C@@H]2CC[C@@H](C1)N2C(c1ccccc1Cl)c1ccccc1Cl)c1ccccn1