Reaction Details
TargetActivated CDC42 kinase 1
LigandBDBM50246215
Substrate/Competitorn/a
Meas. Tech.ChEMBL_559411 (CHEMBL1017265)
Ki 30±n/a nM
Citation Kopecky, DJHao, XChen, YFu, JJiao, XJaen, JCCardozo, MGLiu, JWang, ZWalker, NPWesche, HLi, SFarrelly, EXiao, SHKayser, F Identification and optimization of N3,N6-diaryl-1H-pyrazolo[3,4-d]pyrimidine-3,6-diamines as a novel class of ACK1 inhibitors. Bioorg Med Chem Lett18:6352-6 (2008) 
 
Activated CDC42 kinase 1
Name:Activated CDC42 kinase 1
Type:Protein
Mol. Mass.:114577.86
Organism:Homo sapiens (Human)
Description:Q07912
Residue:1038
BDBM50246215
NameBDBM50246215
Synonyms:(R)-(1-(2-(3-(2,6-dichlorophenylamino)-6-(phenylamino)-1H-pyrazolo[3,4-d]pyrimidin-1-yl)ethyl)pyrrolidin-2-yl)methanol | CHEMBL520403
TypeSmall organic molecule
Emp. Form.C24H25Cl2N7O
Mol. Mass.498.408
SMILESOC[C@H]1CCCN1CCn1nc(Nc2c(Cl)cccc2Cl)c2cnc(Nc3ccccc3)nc12