Reaction Details
TargetActivated CDC42 kinase 1
LigandBDBM50246216
Substrate/Competitorn/a
Meas. Tech.ChEMBL_559411 (CHEMBL1017265)
Ki 10±n/a nM
Citation Kopecky, DJHao, XChen, YFu, JJiao, XJaen, JCCardozo, MGLiu, JWang, ZWalker, NPWesche, HLi, SFarrelly, EXiao, SHKayser, F Identification and optimization of N3,N6-diaryl-1H-pyrazolo[3,4-d]pyrimidine-3,6-diamines as a novel class of ACK1 inhibitors. Bioorg Med Chem Lett18:6352-6 (2008) 
 
Activated CDC42 kinase 1
Name:Activated CDC42 kinase 1
Type:Protein
Mol. Mass.:114577.86
Organism:Homo sapiens (Human)
Description:Q07912
Residue:1038
BDBM50246216
NameBDBM50246216
Synonyms:(R)-N3-(2,6-dichlorophenyl)-1-(2-(3-(dimethylamino)pyrrolidin-1-yl)ethyl)-N6-phenyl-1H-pyrazolo[3,4-d]pyrimidine-3,6-diamine | CHEMBL488061
TypeSmall organic molecule
Emp. Form.C25H28Cl2N8
Mol. Mass.511.449
SMILESCN(C)[C@@H]1CCN(CCn2nc(Nc3c(Cl)cccc3Cl)c3cnc(Nc4ccccc4)nc23)C1