Reaction Details
TargetActivated CDC42 kinase 1
LigandBDBM50245860
Substrate/Competitorn/a
Meas. Tech.ChEMBL_559411 (CHEMBL1017265)
Ki 10±n/a nM
Citation Kopecky, DJHao, XChen, YFu, JJiao, XJaen, JCCardozo, MGLiu, JWang, ZWalker, NPWesche, HLi, SFarrelly, EXiao, SHKayser, F Identification and optimization of N3,N6-diaryl-1H-pyrazolo[3,4-d]pyrimidine-3,6-diamines as a novel class of ACK1 inhibitors. Bioorg Med Chem Lett18:6352-6 (2008) 
 
Activated CDC42 kinase 1
Name:Activated CDC42 kinase 1
Type:Protein
Mol. Mass.:114577.86
Organism:Homo sapiens (Human)
Description:Q07912
Residue:1038
BDBM50245860
NameBDBM50245860
Synonyms:(R)-4-(3-(2,6-dichlorophenylamino)-6-(phenylamino)-1H-pyrazolo[3,4-d]pyrimidin-1-yl)butane-1,2-diol | CHEMBL461159
TypeSmall organic molecule
Emp. Form.C21H20Cl2N6O2
Mol. Mass.459.329
SMILESOC[C@H](O)CCn1nc(Nc2c(Cl)cccc2Cl)c2cnc(Nc3ccccc3)nc12