Reaction Details
TargetActivated CDC42 kinase 1
LigandBDBM50245905
Substrate/Competitorn/a
Meas. Tech.ChEMBL_559412 (CHEMBL1017266)
Ki 50±n/a nM
Citation Kopecky, DJHao, XChen, YFu, JJiao, XJaen, JCCardozo, MGLiu, JWang, ZWalker, NPWesche, HLi, SFarrelly, EXiao, SHKayser, F Identification and optimization of N3,N6-diaryl-1H-pyrazolo[3,4-d]pyrimidine-3,6-diamines as a novel class of ACK1 inhibitors. Bioorg Med Chem Lett18:6352-6 (2008) 
 
Activated CDC42 kinase 1
Name:Activated CDC42 kinase 1
Type:Protein
Mol. Mass.:114577.86
Organism:Homo sapiens (Human)
Description:Q07912
Residue:1038
BDBM50245905
NameBDBM50245905
Synonyms:CHEMBL459220 | N3-mesityl-1-(3-methoxy-3-methylbutyl)-N6-(4-(4-methylpiperazin-1-yl)phenyl)-1H-pyrazolo[3,4-d]pyrimidine-3,6-diamine
TypeSmall organic molecule
Emp. Form.C31H42N8O
Mol. Mass.542.7182
SMILESCOC(C)(C)CCn1nc(Nc2c(C)cc(C)cc2C)c2cnc(Nc3ccc(cc3)N3CCN(C)CC3)nc12