Reaction Details
TargetTyrosine-protein kinase JAK3
LigandBDBM50245853
Substrate/Competitorn/a
Meas. Tech.ChEMBL_559424 (CHEMBL1018105)
Ki>12500±n/a nM
Citation Kopecky, DJHao, XChen, YFu, JJiao, XJaen, JCCardozo, MGLiu, JWang, ZWalker, NPWesche, HLi, SFarrelly, EXiao, SHKayser, F Identification and optimization of N3,N6-diaryl-1H-pyrazolo[3,4-d]pyrimidine-3,6-diamines as a novel class of ACK1 inhibitors. Bioorg Med Chem Lett18:6352-6 (2008) 
 
Tyrosine-protein kinase JAK3
Name:Tyrosine-protein kinase JAK3
Type:Protein
Mol. Mass.:125111.08
Organism:Homo sapiens (Human)
Description:P52333
Residue:1124
BDBM50245853
NameBDBM50245853
Synonyms:CHEMBL502156 | N3-(2,6-dimethylphenyl)-N6-(3-fluoro-4-(2-(pyrrolidin-1-yl)ethoxy)phenyl)-1-(3-methoxy-3-methylbutyl)-1H-pyrazolo[3,4-d]pyrimidine-3,6-diamine
TypeSmall organic molecule
Emp. Form.C31H40FN7O2
Mol. Mass.561.6934
SMILESCOC(C)(C)CCn1nc(Nc2c(C)cccc2C)c2cnc(Nc3ccc(OCCN4CCCC4)c(F)c3)nc12