Reaction Details
TargetCyclin-dependent kinase 1
LigandBDBM50245913
Substrate/Competitorn/a
Meas. Tech.ChEMBL_559443 (CHEMBL1018124)
IC50 9±n/a nM
Citation Jones, CDAndrews, DMBarker, AJBlades, KDaunt, PEast, SGeh, CGraham, MAJohnson, KMLoddick, SAMcFarland, HMMcGregor, AMoss, LRudge, DASimpson, PBSwain, MLTam, KYTucker, JAWalker, M The discovery of AZD5597, a potent imidazole pyrimidine amide CDK inhibitor suitable for intravenous dosing. Bioorg Med Chem Lett18:6369-73 (2008) 
 
Cyclin-dependent kinase 1
Name:Cyclin-dependent kinase 1
Type:Enzyme Subunit
Mol. Mass.:34101.08
Organism:Homo sapiens (Human)
Description:P06493
Residue:297
BDBM50245913
NameBDBM50245913
Synonyms:(4-(4-(1-isopropyl-2-methyl-1H-imidazol-5-yl)pyrimidin-2-ylamino)phenyl)((S)-3-(methylamino)pyrrolidin-1-yl)methanone | CHEMBL460087
TypeSmall organic molecule
Emp. Form.C23H29N7O
Mol. Mass.419.5227
SMILESCN[C@H]1CCN(C1)C(=O)c1ccc(Nc2nccc(n2)-c2cnc(C)n2C(C)C)cc1