Reaction Details
TargetCyclin-dependent kinase 2
LigandBDBM50246358
Substrate/Competitorn/a
Meas. Tech.ChEMBL_559442 (CHEMBL1018123)
IC50 18±n/a nM
Citation Jones, CDAndrews, DMBarker, AJBlades, KDaunt, PEast, SGeh, CGraham, MAJohnson, KMLoddick, SAMcFarland, HMMcGregor, AMoss, LRudge, DASimpson, PBSwain, MLTam, KYTucker, JAWalker, M The discovery of AZD5597, a potent imidazole pyrimidine amide CDK inhibitor suitable for intravenous dosing. Bioorg Med Chem Lett18:6369-73 (2008) 
 
Cyclin-dependent kinase 2
Name:Cyclin-dependent kinase 2
Type:Enzyme Subunit
Mol. Mass.:33938.17
Organism:Homo sapiens (Human)
Description:P24941
Residue:298
BDBM50246358
NameBDBM50246358
Synonyms:(4-(5-fluoro-4-(1-isopropyl-2-methyl-1H-imidazol-5-yl)pyrimidin-2-ylamino)phenyl)(4-methylpiperazin-1-yl)methanone | CHEMBL451462
TypeSmall organic molecule
Emp. Form.C23H28FN7O
Mol. Mass.437.5131
SMILESCC(C)n1c(C)ncc1-c1nc(Nc2ccc(cc2)C(=O)N2CCN(C)CC2)ncc1F