Reaction Details
TargetCytochrome P450 3A4
LigandBDBM50254851
Substrate/Competitorn/a
Meas. Tech.ChEMBL_559938 (CHEMBL1013732)
IC50 200±n/a nM
Citation Westaway, SMBrown, SLConway, EHeightman, TDJohnson, CNLapsley, KMacdonald, GJMacPherson, DTMitchell, DJMyatt, JWSeal, JTStanway, SJStemp, GThompson, MCelestini, PColombo, AConsonni, AGagliardi, SRiccaboni, MRonzoni, SBriggs, MAMatthews, KLStevens, AJBolton, VJBoyfield, IJarvie, EMStratton, SCSanger, GJ The discovery of biaryl carboxamides as novel small molecule agonists of the motilin receptor. Bioorg Med Chem Lett18:6429-36 (2008) 
 
Cytochrome P450 3A4
Name:Cytochrome P450 3A4
Type:Enzyme
Mol. Mass.:57349.57
Organism:Homo sapiens (Human)
Description:n/a
Residue:503
BDBM50254851
NameBDBM50254851
Synonyms:3-Cyclohexyl-1-[4'-((3R,5S)-3,5-dimethyl-piperazin-1-ylmethyl)-biphenyl-2-ylmethyl]-1-[2-(3-methoxy-phenyl)-ethyl]-urea CHEMBL501315
TypeSmall organic molecule
Emp. Form.C36H48N4O2
Mol. Mass.568.7919
SMILESCOc1cccc(CCN(Cc2ccccc2-c2ccc(CN3C[C@H](C)N[C@H](C)C3)cc2)C(=O)NC2CCCCC2)c1