Reaction Details
TargetCytochrome P450 3A4
LigandBDBM50254931
Substrate/Competitorn/a
Meas. Tech.ChEMBL_559938 (CHEMBL1013732)
IC50 900±n/a nM
Citation Westaway, SMBrown, SLConway, EHeightman, TDJohnson, CNLapsley, KMacdonald, GJMacPherson, DTMitchell, DJMyatt, JWSeal, JTStanway, SJStemp, GThompson, MCelestini, PColombo, AConsonni, AGagliardi, SRiccaboni, MRonzoni, SBriggs, MAMatthews, KLStevens, AJBolton, VJBoyfield, IJarvie, EMStratton, SCSanger, GJ The discovery of biaryl carboxamides as novel small molecule agonists of the motilin receptor. Bioorg Med Chem Lett18:6429-36 (2008) 
 
Cytochrome P450 3A4
Name:Cytochrome P450 3A4
Type:Enzyme
Mol. Mass.:57349.57
Organism:Homo sapiens (Human)
Description:n/a
Residue:503
BDBM50254931
NameBDBM50254931
Synonyms:4'-((3R,5S)-3,5-Dimethyl-piperazin-1-ylmethyl)-biphenyl-2-carboxylic acid ethyl-phenethyl-amide | CHEMBL465289
TypeSmall organic molecule
Emp. Form.C30H37N3O
Mol. Mass.455.6343
SMILESCCN(CCc1ccccc1)C(=O)c1ccccc1-c1ccc(CN2C[C@H](C)N[C@H](C)C2)cc1